admin cc scripts

3 jobs for master in 1 minute and 57 seconds (queued for 3 seconds)
Name Stage Failure
failed
unittest_python_3.7 Unittest
FAILED tests/test_neig.py::TestNeigh::test_neig1 - AttributeError: module 'fa...
FAILED tests/test_pipeline.py::TestPipeline::test_pipeline_fit_sign0 - Attrib...
FAILED tests/test_proj.py::TestProj::test_proj1 - AttributeError: module 'fai...
FAILED tests/test_remove_duplicates.py::TestChemicalChecker::test_remove_near
FAILED tests/test_remove_duplicates.py::TestChemicalChecker::test_remove_only_duplicates
============ 6 failed, 21 passed, 17 skipped, 6 warnings in 24.99s =============
make: *** [Makefile:42: test] Error 1
make: Leaving directory '/test/package'
ERROR: Job failed: exit code 1