printing after the pipeline is initialized, so we have arguments in the log file!

2 jobs for refactor_pipeline in 2 minutes and 34 seconds (queued for 2 seconds)
latest
Name Stage Failure
failed
unittest_python_3.7 Unittest
=========================== short test summary info ============================
FAILED tests/test_clus.py::TestClus::test_clus - Exception: The file /test/pa...
FAILED tests/test_neig.py::TestNeigh::test_neig1 - Exception: Fit should be d...
FAILED tests/test_pipeline.py::TestPipeline::test_pipeline_fit_sign0 - TypeEr...
FAILED tests/test_proj.py::TestProj::test_proj1 - Exception: The file /test/p...
====== 4 failed, 27 passed, 13 skipped, 570 warnings in 81.84s (0:01:21) =======
make: *** [Makefile:42: test] Error 1
make: Leaving directory '/test/package'
ERROR: Job failed: exit code 1