removing not needed file

3 jobs for master in 2 minutes and 4 seconds (queued for 1 second)
Status Job ID Name Coverage
  Unittest
failed #7942
unittest_python_3.7

00:01:12

passed #7943
unittest_python_3.7_lite

00:00:52

 
  Docs
skipped #7944
pages
 
Name Stage Failure
failed
unittest_python_3.7 Unittest
FAILED tests/test_neig.py::TestNeigh::test_neig1 - AttributeError: module 'fa...
FAILED tests/test_pipeline.py::TestPipeline::test_pipeline_fit_sign0 - Attrib...
FAILED tests/test_proj.py::TestProj::test_proj1 - AttributeError: module 'fai...
FAILED tests/test_remove_duplicates.py::TestChemicalChecker::test_remove_near
FAILED tests/test_remove_duplicates.py::TestChemicalChecker::test_remove_only_duplicates
============ 6 failed, 21 passed, 17 skipped, 6 warnings in 26.39s =============
make: *** [Makefile:42: test] Error 1
make: Leaving directory '/test/package'
ERROR: Job failed: exit code 1